Target
Non-receptor tyrosine-protein kinase TYK2 [871-1187]
Ligand
BDBM449880
Substrate
Meas. Tech.
Kinase Assay
EC50
1110±n/a nM
Citation
 Larsen, JLarsen, MRasmussen, LKRitzen, ADuus, TM Amino-imidazopyridine derivatives as Janus kinase inhibitors and pharmaceutical use thereof US Patent  US10703751 Publication Date 7/7/2020 
Target
Name:
Non-receptor tyrosine-protein kinase TYK2 [871-1187]
Synonyms:
Non-receptor tyrosine-protein kinase TYK2 TYK2 TYK2_HUMAN
Type:
Protein
Mol. Mass.:
36255.07
Organism:
Homo sapiens (Human)
Description:
P29597[871-1187]
Residue:
317
  
Inhibitor
Name:
BDBM449880
Synonyms:
US10703751, Example 6 | cis-2-[4-[2-[1-Hydroxyethyl]-6-(methylamino)imidazo[4,5-c]pyridin-1-yl]cyclohexyl]acetonitrile
Type:
Small organic molecule
Emp. Form.:
C17H23N5O
Mol. Mass.:
313.3974
SMILES:
CNc1cc2n([C@@H]3CC[C@H](CC#N)CC3)c(nc2cn1)C(C)O
: