Target
Tyrosine-protein kinase JAK3 [781-1124]
Ligand
BDBM103727
Substrate
Meas. Tech.
Inhibition Assay
IC50
180±21 nM
Citation
 Wigerinck, PSabourault, NL Salts and pharmaceutical compositions thereof for the treatment of inflammatory disorders US Patent  US10708263 Publication Date 7/7/2020 
Target
Name:
Tyrosine-protein kinase JAK3 [781-1124]
Synonyms:
JAK3 JAK3_HUMAN Tyrosine-protein kinase JAK3 Tyrosine-protein kinase JAK3 (aa 781-1124)
Type:
Mol. Mass.:
38772.27
Organism:
Homo sapiens (Human)
Description:
P52333[781-1124]
Residue:
344
  
Inhibitor
Name:
BDBM103727
Synonyms:
US10112907, Example 00033 US10708263, Compound 1 US10919890, Compound 1 US11000528, Cpd # 1 US11279699, Compound Filgotinib | US8563545, 1
Type:
Small organic molecule
Emp. Form.:
C21H23N5O3S
Mol. Mass.:
425.504
SMILES:
O=C(Nc1nc2cccc(-c3ccc(CN4CCS(=O)(=O)CC4)cc3)n2n1)C1CC1
: