Target
Somatostatin receptor type 1
Ligand
BDBM311927
Substrate
Meas. Tech.
Radioligand Binding Assays
Ki
>7514±n/a nM
Citation
 Giovannini, RCui, YDoods, HFerrara, MJust, SKuelzer, RLingard, IMazzaferro, RRudolf, K Somatostatin receptor subtype 4 (SSTR4) agonists US Patent  US10675268 Publication Date 6/9/2020 
Target
Name:
Somatostatin receptor type 1
Synonyms:
SOMATOSTATIN SST1 SS-1-R SS1R SSTR1 | Somatostatin receptor type 1 (SSTR1)
Type:
Enzyme
Mol. Mass.:
42692.81
Organism:
Homo sapiens (Human)
Description:
P30872
Residue:
391
  
Inhibitor
Name:
BDBM311927
Synonyms:
US10166214, Example 63 US9789082, Example 63
Type:
Small organic molecule
Emp. Form.:
C16H20F3N3O2
Mol. Mass.:
343.3441
SMILES:
CC(C)(COc1cnccc1C(F)(F)F)NC(=O)[C@@H]1[C@H]2CNC[C@@H]12
: