Target
Phosphatidylinositol 4,5-bisphosphate 3-kinase catalytic subunit beta isoform
Ligand
BDBM342534
Substrate
Meas. Tech.
PI3-Kinase HTRF Assay
IC50
2000±n/a nM
Citation
 Kutok, JLWinkler, DGPalombella, VJ Heterocyclic compounds and uses thereof US Patent  US10675286 Publication Date 6/9/2020 
Target
Name:
Phosphatidylinositol 4,5-bisphosphate 3-kinase catalytic subunit beta isoform
Synonyms:
PI3-kinase p110 subunit beta PI3Kbeta PIK3CB Phosphatidylinositol 4,5-bisphosphate 3-kinase catalytic subunit beta (PI3Kbeta) Phosphatidylinositol 4,5-bisphosphate 3-kinase catalytic subunit beta isoform (PI3K) Phosphatidylinositol 4,5-bisphosphate 3-kinase catalytic subunit beta isoform (PI3Kbeta) Phosphatidylinositol-4,5-bisphosphate 3-kinase catalytic subunit beta isoform Phosphoinositide 3-Kinase (PI3K), beta Chain A PtdIns-3-kinase p110
Type:
Enzyme Subunit
Mol. Mass.:
122769.00
Organism:
Homo sapiens (Human)
Description:
P42338
Residue:
1070
  
Inhibitor
Name:
BDBM342534
Synonyms:
US10329299, Compound 85 US11541059, Compound 85 | US9775844, Compound 85
Type:
Small organic molecule
Emp. Form.:
C32H31N7O2
Mol. Mass.:
545.6342
SMILES:
C[C@H](NC(=O)c1c(N)nn2cccnc12)c1cc2cccc(C#CC3CCN(C)CC3)c2c(=O)n1-c1ccccc1
: