Target
N-formyl peptide receptor 2
Ligand
BDBM450257
Substrate
Meas. Tech.
FPR2 and FPR1 Cyclic Adenosine Monophosphate (cAMP) Assays
EC50
31.0±n/a nM
Citation
 Shirude, PSBaligar, VSeshadri, BChattopadhyay, AKWurtz, NRKick, EK Phenylpyrrolidinone formyl peptide 2 receptor agonists US Patent  US10676431 Publication Date 6/9/2020 
Target
Name:
N-formyl peptide receptor 2
Synonyms:
ALXR, FPRL1, FPR2 FPR2 FPRH1 Formyl Peptide Receptor-Like 1 LXA4 receptor Lipoxin A4 receptor RFP | hFPRL
Type:
G Protein-Coupled Receptor (GPCR)
Mol. Mass.:
38968.35
Organism:
Homo sapiens (Human)
Description:
P25090
Residue:
351
  
Inhibitor
Name:
BDBM450257
Synonyms:
US10676431, Example 21 | US11117861, Example 21
Type:
Small organic molecule
Emp. Form.:
C23H16ClF4N3O2
Mol. Mass.:
477.839
SMILES:
Fc1cc(Cl)ccc1NC(=O)N[C@@H]1CCN(C1=O)c1ccc(c(F)c1F)-c1ccccc1F
: