Target
fMet-Leu-Phe receptor
Ligand
BDBM450320
Substrate
Meas. Tech.
FPR2 and FPR1 Cyclic Adenosine Monophosphate (cAMP) Assays
EC50
0.990±n/a nM
Citation
 Shirude, PSBaligar, VSeshadri, BChattopadhyay, AKWurtz, NRKick, EK Phenylpyrrolidinone formyl peptide 2 receptor agonists US Patent  US10676431 Publication Date 6/9/2020 
Target
Name:
fMet-Leu-Phe receptor
Synonyms:
FPR FPR1_HUMAN N-formyl peptide receptor 1 fMLP receptor formyl peptide receptor 1
Type:
Enzyme Catalytic Domain
Mol. Mass.:
38456.14
Organism:
Homo sapiens (Human)
Description:
gi_4503779
Residue:
350
  
Inhibitor
Name:
BDBM450320
Synonyms:
US10676431, Example 83 | US11117861, Example 83
Type:
Small organic molecule
Emp. Form.:
C26H22ClF5N3O3P
Mol. Mass.:
585.89
SMILES:
CP(C)(=O)c1ccccc1-c1ccc(N2CC[C@@H](NC(=O)Nc3ccc(Cl)cc3F)C2=O)c(F)c1C(F)(F)F
: