Target
N-formyl peptide receptor 2
Ligand
BDBM450340
Substrate
Meas. Tech.
FPR2 and FPR1 Cyclic Adenosine Monophosphate (cAMP) Assays
EC50
0.570±n/a nM
Citation
 Shirude, PSBaligar, VSeshadri, BChattopadhyay, AKWurtz, NRKick, EK Phenylpyrrolidinone formyl peptide 2 receptor agonists US Patent  US10676431 Publication Date 6/9/2020 
Target
Name:
N-formyl peptide receptor 2
Synonyms:
ALXR, FPRL1, FPR2 FPR2 FPRH1 Formyl Peptide Receptor-Like 1 LXA4 receptor Lipoxin A4 receptor RFP | hFPRL
Type:
G Protein-Coupled Receptor (GPCR)
Mol. Mass.:
38968.35
Organism:
Homo sapiens (Human)
Description:
P25090
Residue:
351
  
Inhibitor
Name:
BDBM450340
Synonyms:
US10676431, Example 103 | US11117861, Example 103
Type:
Small organic molecule
Emp. Form.:
C27H26ClF3N3O3P
Mol. Mass.:
563.936
SMILES:
CC1(C)CN(C(=O)[C@@H]1NC(=O)Nc1ccc(Cl)cc1F)c1ccc(c(F)c1F)-c1ccccc1P(C)(C)=O
: