Target
Tyrosine-protein kinase Mer
Ligand
BDBM298799
Substrate
Meas. Tech.
TBD
IC50
<10±n/a nM
Citation
 Kim, MKim, SKim, JKKim, HRyu, KMPark, SJPark, TSheen, JYoon, TJang, MY Heteroaryl compounds and their use as therapeutic drugs US Patent  US10125118 Publication Date 11/13/2018 
Target
Name:
Tyrosine-protein kinase Mer
Synonyms:
MER MERTK Proto-oncogene c-Mer Receptor tyrosine kinase MerTK | Tyrosine-protein kinase Mer
Type:
PROTEIN
Mol. Mass.:
110234.77
Organism:
Homo sapiens (Human)
Description:
ChEMBL_1498723
Residue:
999
  
Inhibitor
Name:
BDBM298799
Synonyms:
US10125118, Example 205 | US10947215, Example 205
Type:
Small organic molecule
Emp. Form.:
C36H42F3N7O3
Mol. Mass.:
677.759
SMILES:
Cn1cc(cn1)-c1cnc(N)c(c1)C(=O)N[C@H]1CCC[C@@H]1OCc1ccc(cc1)-c1ccc(CN2CCN(CCO)CC2)c(c1)C(F)(F)F
: