Target
Tyrosine-protein kinase Mer
Ligand
BDBM298965
Substrate
Meas. Tech.
TBD
IC50
<10±n/a nM
Citation
 Kim, MKim, SKim, JKKim, HRyu, KMPark, SJPark, TSheen, JYoon, TJang, MY Heteroaryl compounds and their use as therapeutic drugs US Patent  US10125118 Publication Date 11/13/2018 
Target
Name:
Tyrosine-protein kinase Mer
Synonyms:
MER MERTK Proto-oncogene c-Mer Receptor tyrosine kinase MerTK | Tyrosine-protein kinase Mer
Type:
PROTEIN
Mol. Mass.:
110234.77
Organism:
Homo sapiens (Human)
Description:
ChEMBL_1498723
Residue:
999
  
Inhibitor
Name:
BDBM298965
Synonyms:
US10125118, Example 371 | US10947215, Example 371
Type:
Small organic molecule
Emp. Form.:
C36H41N5O2
Mol. Mass.:
575.743
SMILES:
CN1CCN(Cc2ccc(cc2)-c2ccc(CO[C@H]3CCC[C@@H]3NC(=O)c3cc(cnc3N)-c3ccccc3)cc2)CC1
: