Target
P2X purinoceptor 7
Ligand
BDBM398104
Substrate
Meas. Tech.
Pore Permeation Assay
IC50
55±n/a nM
Citation
 Karra, SR Indole derivatives and their use in neurodegenerative diseases US Patent  US10676433 Publication Date 6/9/2020 
Target
Name:
P2X purinoceptor 7
Synonyms:
ATP receptor P2RX7_HUMAN P2X purinoceptor 7 (P2X7) P2Z receptor | Purinergic receptor
Type:
Protein
Mol. Mass.:
68602.85
Organism:
Homo sapiens (Human)
Description:
Q99572
Residue:
595
  
Inhibitor
Name:
BDBM398104
Synonyms:
4-chloro-1-(2-methoxyethyl)-N-((1-phenylcyclohexyl) methyl)-1H-indole-3-carboxamide US10676433, Compound 39
Type:
Small organic molecule
Emp. Form.:
C25H29ClN2O2
Mol. Mass.:
424.963
SMILES:
COCCn1cc(C(=O)NCC2(CCCCC2)c2ccccc2)c2c(Cl)cccc12
: