Target
P2X purinoceptor 7
Ligand
BDBM398128
Substrate
Meas. Tech.
Pore Permeation Assay
IC50
55±n/a nM
Citation
 Karra, SR Indole derivatives and their use in neurodegenerative diseases US Patent  US10676433 Publication Date 6/9/2020 
Target
Name:
P2X purinoceptor 7
Synonyms:
ATP receptor P2RX7_HUMAN P2X purinoceptor 7 (P2X7) P2Z receptor | Purinergic receptor
Type:
Protein
Mol. Mass.:
68602.85
Organism:
Homo sapiens (Human)
Description:
Q99572
Residue:
595
  
Inhibitor
Name:
BDBM398128
Synonyms:
4-Chloro-1-oxetan-3-yl-1H-indole-3-carboxylic acid (1-adamantan-1-yl-ethyl)-amide US10676433, Compound 62
Type:
Small organic molecule
Emp. Form.:
C24H29ClN2O2
Mol. Mass.:
412.952
SMILES:
CC(NC(=O)c1cn(C2COC2)c2cccc(Cl)c12)[C@]12C[C@H]3C[C@H](C[C@H](C3)C1)C2
: