Target
Interleukin-1 beta
Ligand
BDBM398179
Substrate
Meas. Tech.
IL-1beta Release Assay
IC50
55±n/a nM
Citation
 Karra, SR Indole derivatives and their use in neurodegenerative diseases US Patent  US10676433 Publication Date 6/9/2020 
Target
Name:
Interleukin-1 beta
Synonyms:
IL1B IL1F2 Interleukin-1 beta | hIL-1beta
Type:
Cytokine
Mol. Mass.:
30734.47
Organism:
Homo sapiens (Human)
Description:
P01584
Residue:
269
  
Inhibitor
Name:
BDBM398179
Synonyms:
US10323000, Compound 116 | US10676433, Compound 116
Type:
Small organic molecule
Emp. Form.:
C20H23ClF2N2O2
Mol. Mass.:
396.859
SMILES:
FC1(F)CCC(CNC(=O)c2cn(CC3CCO3)c3cccc(Cl)c23)CC1
: