Target
P2X purinoceptor 7
Ligand
BDBM450521
Substrate
Meas. Tech.
Pore Permeation Assay
IC50
<10±n/a nM
Citation
 Karra, SR Indole derivatives and their use in neurodegenerative diseases US Patent  US10676433 Publication Date 6/9/2020 
Target
Name:
P2X purinoceptor 7
Synonyms:
ATP receptor P2RX7_HUMAN P2X purinoceptor 7 (P2X7) P2Z receptor | Purinergic receptor
Type:
Protein
Mol. Mass.:
68602.85
Organism:
Homo sapiens (Human)
Description:
Q99572
Residue:
595
  
Inhibitor
Name:
BDBM450521
Synonyms:
US10676433, Compound 153
Type:
Small organic molecule
Emp. Form.:
C21H26ClF2N3O
Mol. Mass.:
409.9
SMILES:
FC1(F)CCC(CNC(=O)c2cn(C[C@@H]3CCCN3)c3cccc(Cl)c23)CC1
: