Target
P2X purinoceptor 7
Ligand
BDBM398249
Substrate
Meas. Tech.
Pore Permeation Assay
IC50
55±n/a nM
Citation
 Karra, SR Indole derivatives and their use in neurodegenerative diseases US Patent  US10676433 Publication Date 6/9/2020 
Target
Name:
P2X purinoceptor 7
Synonyms:
ATP receptor P2RX7_HUMAN P2X purinoceptor 7 (P2X7) P2Z receptor | Purinergic receptor
Type:
Protein
Mol. Mass.:
68602.85
Organism:
Homo sapiens (Human)
Description:
Q99572
Residue:
595
  
Inhibitor
Name:
BDBM398249
Synonyms:
4-chloro-N-((4, 4-difluorocyclohexyl)methyl)-1-(2-(2-oxopyrrolidin-1-yl)ethyl)-1H-indole-3-carboxamide US10676433, Compound 189
Type:
Small organic molecule
Emp. Form.:
C22H26ClF2N3O2
Mol. Mass.:
437.911
SMILES:
FC1(F)CCC(CNC(=O)c2cn(CCN3CCCC3=O)c3cccc(Cl)c23)CC1
: