Target
Tyrosine-protein kinase BTK
Ligand
BDBM377381
Substrate
Meas. Tech.
Human Recombinant Btk Enzyme Assay
IC50
0.110±n/a nM
Citation
 Ahmad, SBatt, DGLiu, QMacor, JETino, JAWatterson, SHNair, SKMaishal, TK Carbazole derivatives US Patent  US10676434 Publication Date 6/9/2020 
Target
Name:
Tyrosine-protein kinase BTK
Synonyms:
AGMX1 Agammaglobulinaemia tyrosine kinase B cell progenitor kinase BPK BTK_HUMAN Tyrosine Kinase BTK Tyrosine-protein kinase BTK (BTK)
Type:
Enzyme
Mol. Mass.:
76289.95
Organism:
Homo sapiens (Human)
Description:
Q06187
Residue:
659
  
Inhibitor
Name:
BDBM377381
Synonyms:
US10266491, Example 49 US11053197, Example 49
Type:
Small organic molecule
Emp. Form.:
C22H23N3O3S
Mol. Mass.:
409.501
SMILES:
Cc1c(NS(=O)(=O)C=C)cccc1-c1ccc(C(N)=O)c2[nH]c3CCCCc3c12
: