Target
Tyrosine-protein kinase BTK
Ligand
BDBM377414
Substrate
Meas. Tech.
Human Recombinant Btk Enzyme Assay
IC50
0.100±n/a nM
Citation
 Ahmad, SBatt, DGLiu, QMacor, JETino, JAWatterson, SHNair, SKMaishal, TK Carbazole derivatives US Patent  US10676434 Publication Date 6/9/2020 
Target
Name:
Tyrosine-protein kinase BTK
Synonyms:
AGMX1 Agammaglobulinaemia tyrosine kinase B cell progenitor kinase BPK BTK_HUMAN Tyrosine Kinase BTK Tyrosine-protein kinase BTK (BTK)
Type:
Enzyme
Mol. Mass.:
76289.95
Organism:
Homo sapiens (Human)
Description:
Q06187
Residue:
659
  
Inhibitor
Name:
BDBM377414
Synonyms:
US10266491, Example 96 US11053197, Example 96
Type:
Small organic molecule
Emp. Form.:
C21H18FN3O2
Mol. Mass.:
363.3849
SMILES:
NC(=O)c1cc(F)c(C2=CCCN(C2)C(=O)C=C)c2c3ccccc3[nH]c12
: