Target
Potassium voltage-gated channel subfamily H member 2
Ligand
BDBM450381
Substrate
Meas. Tech.
Evaluation of Action on hERG IKr Current
IC50
>10000±n/a nM
Citation
 Yashiro, KWakamatsu, DSaito, T KCNQ2-5 channel activator US Patent  US10676438 Publication Date 6/9/2020 
Target
Name:
Potassium voltage-gated channel subfamily H member 2
Synonyms:
1,3-beta-glucan synthase component GLS2 ERG Eag-related protein 1 Ether-a-go-go-related gene (HERG) Ether-a-go-go-related gene potassium channel 1 Ether-a-go-go-related gene potassium channel 1 (hERG1) Ether-a-go-go-related protein 1 H-ERG KCNH2 Potassium voltage-gated channel subfamily H member 2 (hERG) Voltage-gated potassium channel subunit Kv11.1 hERG Potassium Channel 1 | putative potassium channel subunit
Type:
Multi-pass membrane protein
Mol. Mass.:
126672.65
Organism:
Homo sapiens (Human)
Description:
Q12809
Residue:
1159
  
Inhibitor
Name:
BDBM450381
Synonyms:
2-cyclohexyl-N-[2,6-dichloro-4-(1,1,1-trifluoro-2-hydroxy-2-propanyl) phenyl]acetamide | US10676438, Example 50
Type:
Small organic molecule
Emp. Form.:
C17H20Cl2F3NO2
Mol. Mass.:
398.247
SMILES:
CC(O)(c1cc(Cl)c(NC(=O)CC2CCCCC2)c(Cl)c1)C(F)(F)F
: