Target
Ectonucleotide pyrophosphatase/phosphodiesterase family member 2
Ligand
BDBM450405
Substrate
Meas. Tech.
Human ATX Enzyme Inhibition Assay
IC50
91.0±n/a nM
Citation
 Hert, JHunziker, DKuratli, CMartin, REMattei, PSatz, AL Bicyclic quinazolinone derivatives US Patent  US10676446 Publication Date 6/9/2020 
Target
Name:
Ectonucleotide pyrophosphatase/phosphodiesterase family member 2
Synonyms:
ATX Autotaxin (ATX) ENPP2 Ectonucleotide Pyrophosphatase/Phosphodiesterase 2 (ENPP2) Extracellular lysophospholipase D PDNP2
Type:
Enzyme
Mol. Mass.:
99007.13
Organism:
Homo sapiens (Human)
Description:
Q13822
Residue:
863
  
Inhibitor
Name:
BDBM450405
Synonyms:
2-[6-(4- Acetylpiperazin-1- yl)-4- oxoquinazolin-3- yl]acetic acid (intermediate A-2) and (3,4- dichlorophenyl) methanamine ([CAS RN 102-49-8]) | US10676446, Example 22
Type:
Small organic molecule
Emp. Form.:
C23H23Cl2N5O3
Mol. Mass.:
488.366
SMILES:
CC(=O)N1CCN(CC1)c1ccc2ncn(CC(=O)NCc3ccc(Cl)c(Cl)c3)c(=O)c2c1
: