Target
Ectonucleotide pyrophosphatase/phosphodiesterase family member 2
Ligand
BDBM450427
Substrate
Meas. Tech.
Human ATX Enzyme Inhibition Assay
IC50
140±n/a nM
Citation
 Hert, JHunziker, DKuratli, CMartin, REMattei, PSatz, AL Bicyclic quinazolinone derivatives US Patent  US10676446 Publication Date 6/9/2020 
Target
Name:
Ectonucleotide pyrophosphatase/phosphodiesterase family member 2
Synonyms:
ATX Autotaxin (ATX) ENPP2 Ectonucleotide Pyrophosphatase/Phosphodiesterase 2 (ENPP2) Extracellular lysophospholipase D PDNP2
Type:
Enzyme
Mol. Mass.:
99007.13
Organism:
Homo sapiens (Human)
Description:
Q13822
Residue:
863
  
Inhibitor
Name:
BDBM450427
Synonyms:
2-[6-[4-(9H- Fluoren-9- ylmethoxycarbonyl) piperazin-1-yl]- 4-oxoquinazolin- 3-yl]acetic acid (intermediate A-1) and (3-chloro-4- methylphenyl) methanamine ([CAS RN 67952-93-6]) | US10676446, Example 42
Type:
Small organic molecule
Emp. Form.:
C24H26ClN5O3
Mol. Mass.:
467.948
SMILES:
CC(=O)N1CCN(CC1)c1ccc2ncn(CC(=O)NCc3ccc(C)c(Cl)c3)c(=O)c2c1
: