Target
Ectonucleotide pyrophosphatase/phosphodiesterase family member 2
Ligand
BDBM450434
Substrate
Meas. Tech.
Human ATX Enzyme Inhibition Assay
IC50
184±n/a nM
Citation
 Hert, JHunziker, DKuratli, CMartin, REMattei, PSatz, AL Bicyclic quinazolinone derivatives US Patent  US10676446 Publication Date 6/9/2020 
Target
Name:
Ectonucleotide pyrophosphatase/phosphodiesterase family member 2
Synonyms:
ATX Autotaxin (ATX) ENPP2 Ectonucleotide Pyrophosphatase/Phosphodiesterase 2 (ENPP2) Extracellular lysophospholipase D PDNP2
Type:
Enzyme
Mol. Mass.:
99007.13
Organism:
Homo sapiens (Human)
Description:
Q13822
Residue:
863
  
Inhibitor
Name:
BDBM450434
Synonyms:
2-[6-[4-(9H- Fluoren-9- ylmethoxycarbonyl) piperazin-1-yl]- 4-oxoquinazolin- 3-yl]acetic acid (intermediate A-1) and 1-(2,6- dichloropyridin-4- yl)-N-methyl- methanamine ([CAS RN 873928-49-5]) | US10676446, Example 46
Type:
Small organic molecule
Emp. Form.:
C23H24Cl2N6O3
Mol. Mass.:
503.381
SMILES:
CN(Cc1cc(Cl)nc(Cl)c1)C(=O)Cn1cnc2ccc(cc2c1=O)N1CCN(CC1)C(C)=O
: