Target
Ectonucleotide pyrophosphatase/phosphodiesterase family member 2
Ligand
BDBM450454
Substrate
Meas. Tech.
Human ATX Enzyme Inhibition Assay
IC50
11.0±n/a nM
Citation
 Hert, JHunziker, DKuratli, CMartin, REMattei, PSatz, AL Bicyclic quinazolinone derivatives US Patent  US10676446 Publication Date 6/9/2020 
Target
Name:
Ectonucleotide pyrophosphatase/phosphodiesterase family member 2
Synonyms:
ATX Autotaxin (ATX) ENPP2 Ectonucleotide Pyrophosphatase/Phosphodiesterase 2 (ENPP2) Extracellular lysophospholipase D PDNP2
Type:
Enzyme
Mol. Mass.:
99007.13
Organism:
Homo sapiens (Human)
Description:
Q13822
Residue:
863
  
Inhibitor
Name:
BDBM450454
Synonyms:
9H-Fluoren-9-ylmethyl 4-[3-[2- [(3,4-dichlorophenyl)methyl- amino]-2-oxoethyl]-4- oxoquinazolin-6-yl] piperazine-1-carboxylate (intermediate A-5) and cyclobutanecarbonyl chloride ([CAS RN 5006-22-6]) | US10676446, Example 63
Type:
Small organic molecule
Emp. Form.:
C26H27Cl2N5O3
Mol. Mass.:
528.43
SMILES:
Clc1ccc(CNC(=O)Cn2cnc3ccc(cc3c2=O)N2CCN(CC2)C(=O)C2CCC2)cc1Cl
: