Target
Ectonucleotide pyrophosphatase/phosphodiesterase family member 2
Ligand
BDBM450520
Substrate
Meas. Tech.
Human ATX Enzyme Inhibition Assay
IC50
71.0±n/a nM
Citation
 Hert, JHunziker, DKuratli, CMartin, REMattei, PSatz, AL Bicyclic quinazolinone derivatives US Patent  US10676446 Publication Date 6/9/2020 
Target
Name:
Ectonucleotide pyrophosphatase/phosphodiesterase family member 2
Synonyms:
ATX Autotaxin (ATX) ENPP2 Ectonucleotide Pyrophosphatase/Phosphodiesterase 2 (ENPP2) Extracellular lysophospholipase D PDNP2
Type:
Enzyme
Mol. Mass.:
99007.13
Organism:
Homo sapiens (Human)
Description:
Q13822
Residue:
863
  
Inhibitor
Name:
BDBM450520
Synonyms:
9H-Fluoren-9- ylmethyl 4-[3-[2- [(3,4- dichlorophenyl) methyl- methylamino]-2- oxoethyl]-4- oxoquinazolin-6- yl]piperazine-1- carboxylate (intermediate A-6) and 2-chloro-N- | US10676446, Example 112
Type:
Small organic molecule
Emp. Form.:
C30H30Cl2N6O3
Mol. Mass.:
593.504
SMILES:
CN(Cc1ccc(Cl)c(Cl)c1)C(=O)Cn1cnc2ccc(cc2c1=O)N1CCN(CC(=O)Nc2ccccc2)CC1
: