Target
Ectonucleotide pyrophosphatase/phosphodiesterase family member 2
Ligand
BDBM450563
Substrate
Meas. Tech.
Human ATX Enzyme Inhibition Assay
IC50
140±n/a nM
Citation
 Hert, JHunziker, DKuratli, CMartin, REMattei, PSatz, AL Bicyclic quinazolinone derivatives US Patent  US10676446 Publication Date 6/9/2020 
Target
Name:
Ectonucleotide pyrophosphatase/phosphodiesterase family member 2
Synonyms:
ATX Autotaxin (ATX) ENPP2 Ectonucleotide Pyrophosphatase/Phosphodiesterase 2 (ENPP2) Extracellular lysophospholipase D PDNP2
Type:
Enzyme
Mol. Mass.:
99007.13
Organism:
Homo sapiens (Human)
Description:
Q13822
Residue:
863
  
Inhibitor
Name:
BDBM450563
Synonyms:
2-[6-[2-Acetyl-2-azabicyclo[2.2.1]heptan-5-yl]-4-oxoquinazolin-3-yl]-N-[(3,4-dichlorophenyl)methyl]acetamide | US10676446, Example 147
Type:
Small organic molecule
Emp. Form.:
C25H24Cl2N4O3
Mol. Mass.:
499.389
SMILES:
CC(=O)N1CC2CC1CC2c1ccc2ncn(CC(=O)NCc3ccc(Cl)c(Cl)c3)c(=O)c2c1
: