Target
Ectonucleotide pyrophosphatase/phosphodiesterase family member 2
Ligand
BDBM450581
Substrate
Meas. Tech.
Human ATX Enzyme Inhibition Assay
IC50
20.0±n/a nM
Citation
 Hert, JHunziker, DKuratli, CMartin, REMattei, PSatz, AL Bicyclic quinazolinone derivatives US Patent  US10676446 Publication Date 6/9/2020 
Target
Name:
Ectonucleotide pyrophosphatase/phosphodiesterase family member 2
Synonyms:
ATX Autotaxin (ATX) ENPP2 Ectonucleotide Pyrophosphatase/Phosphodiesterase 2 (ENPP2) Extracellular lysophospholipase D PDNP2
Type:
Enzyme
Mol. Mass.:
99007.13
Organism:
Homo sapiens (Human)
Description:
Q13822
Residue:
863
  
Inhibitor
Name:
BDBM450581
Synonyms:
N-[(3,4-Dichlorophenyl)methyl]-N-methyl-2-[4-oxo-6-[1-(2-sulfamoylacetyl)piperidin-4-yl]quinazolin-3-yl]acetamide | US10676446, Example 165
Type:
Small organic molecule
Emp. Form.:
C25H27Cl2N5O5S
Mol. Mass.:
580.483
SMILES:
CN(Cc1ccc(Cl)c(Cl)c1)C(=O)Cn1cnc2ccc(cc2c1=O)C1CCN(CC1)C(=O)CS(N)(=O)=O
: