Target
Lysine-specific histone demethylase 1A
Ligand
BDBM397505
Substrate
Meas. Tech.
LSD1 histone demethylase biochemical assay
IC50
<100±n/a nM
Citation
 Wu, LYao, W Cyclopropylamines as LSD1 inhibitors US Patent  US10676457 Publication Date 6/9/2020 
Target
Name:
Lysine-specific histone demethylase 1A
Synonyms:
AOF2 Flavin-containing amine oxidase domain-containing protein 2 KDM1A KIAA0601 Lysine-specific demethylase 1 (LSD1) Lysine-specific histone demethylase 1 (LSD1)
Type:
Enzyme
Mol. Mass.:
92901.01
Organism:
Homo sapiens (Human)
Description:
O60341
Residue:
852
  
Inhibitor
Name:
BDBM397505
Synonyms:
(1-Benzyl-3-{4-[(trans-2-phenylcyclopropyl)amino]piperidin-1-yl}azetidin-3-yl)acetonitrile US11155532, Example 4 | US9994546, Example 4
Type:
Small organic molecule
Emp. Form.:
C26H32N4
Mol. Mass.:
400.5591
SMILES:
N#CCC1(CN(Cc2ccccc2)C1)N1CCC(CC1)NC1CC1c1ccccc1
: