Target
Lysine-specific histone demethylase 1A
Ligand
BDBM397518
Substrate
Meas. Tech.
LSD1 histone demethylase biochemical assay
IC50
<100±n/a nM
Citation
 Wu, LYao, W Cyclopropylamines as LSD1 inhibitors US Patent  US10676457 Publication Date 6/9/2020 
Target
Name:
Lysine-specific histone demethylase 1A
Synonyms:
AOF2 Flavin-containing amine oxidase domain-containing protein 2 KDM1A KIAA0601 Lysine-specific demethylase 1 (LSD1) Lysine-specific histone demethylase 1 (LSD1)
Type:
Enzyme
Mol. Mass.:
92901.01
Organism:
Homo sapiens (Human)
Description:
O60341
Residue:
852
  
Inhibitor
Name:
BDBM397518
Synonyms:
US10676457, Example 17 US9994546, Example 17 | [1-Methyl-4-(3-{[(trans-2-phenylcyclopropyl)amino]methyl}azetidin-1-yl)piperidin-4-yl]acetonitrile
Type:
Small organic molecule
Emp. Form.:
C21H30N4
Mol. Mass.:
338.4897
SMILES:
CN1CCC(CC#N)(CC1)N1CC(CNC2CC2c2ccccc2)C1
: