Target
Lysine-specific histone demethylase 1A
Ligand
BDBM397540
Substrate
Meas. Tech.
LSD1 histone demethylase biochemical assay
IC50
<100±n/a nM
Citation
 Wu, LYao, W Cyclopropylamines as LSD1 inhibitors US Patent  US10676457 Publication Date 6/9/2020 
Target
Name:
Lysine-specific histone demethylase 1A
Synonyms:
AOF2 Flavin-containing amine oxidase domain-containing protein 2 KDM1A KIAA0601 Lysine-specific demethylase 1 (LSD1) Lysine-specific histone demethylase 1 (LSD1)
Type:
Enzyme
Mol. Mass.:
92901.01
Organism:
Homo sapiens (Human)
Description:
O60341
Residue:
852
  
Inhibitor
Name:
BDBM397540
Synonyms:
2-[3-(Cyanomethyl)-3-(4-{[(trans-2-phenylcyclopropyl)amino]methyl}piperidin-1-yl)azetidin-1-yl]benzonitrile US11155532, Example 39 | US9994546, Example 39
Type:
Small organic molecule
Emp. Form.:
C27H31N5
Mol. Mass.:
425.5685
SMILES:
N#CCC1(CN(C1)c1ccccc1C#N)N1CCC(CNC2CC2c2ccccc2)CC1
: