Target
Lysine-specific histone demethylase 1A
Ligand
BDBM397568
Substrate
Meas. Tech.
LSD1 histone demethylase biochemical assay
IC50
<100±n/a nM
Citation
 Wu, LYao, W Cyclopropylamines as LSD1 inhibitors US Patent  US10676457 Publication Date 6/9/2020 
Target
Name:
Lysine-specific histone demethylase 1A
Synonyms:
AOF2 Flavin-containing amine oxidase domain-containing protein 2 KDM1A KIAA0601 Lysine-specific demethylase 1 (LSD1) Lysine-specific histone demethylase 1 (LSD1)
Type:
Enzyme
Mol. Mass.:
92901.01
Organism:
Homo sapiens (Human)
Description:
O60341
Residue:
852
  
Inhibitor
Name:
BDBM397568
Synonyms:
US10676457, Example 67 US9994546, Example 67 | [1-ethyl-3-(4-{[(1R,2S)-2-phenylcyclopropyl]amino}piperidin-1-yl)azetidin-3-yl]acetic acid
Type:
Small organic molecule
Emp. Form.:
C21H31N3O2
Mol. Mass.:
357.4897
SMILES:
CCN1CC(CC(O)=O)(C1)N1CCC(CC1)N[C@@H]1CC1c1ccccc1
: