Target
Lysine-specific histone demethylase 1A
Ligand
BDBM397580
Substrate
Meas. Tech.
LSD1 histone demethylase biochemical assay
IC50
<100±n/a nM
Citation
 Wu, LYao, W Cyclopropylamines as LSD1 inhibitors US Patent  US10676457 Publication Date 6/9/2020 
Target
Name:
Lysine-specific histone demethylase 1A
Synonyms:
AOF2 Flavin-containing amine oxidase domain-containing protein 2 KDM1A KIAA0601 Lysine-specific demethylase 1 (LSD1) Lysine-specific histone demethylase 1 (LSD1)
Type:
Enzyme
Mol. Mass.:
92901.01
Organism:
Homo sapiens (Human)
Description:
O60341
Residue:
852
  
Inhibitor
Name:
BDBM397580
Synonyms:
2-[3-(cyanomethyl)-3-(4-{[(1R,2S)-2-phenylcyclopropyl]amino}piperidin-1-yl)azetidin-1-yl]acetamide US11155532, Example 79 | US9994546, Example 79
Type:
Small organic molecule
Emp. Form.:
C21H29N5O
Mol. Mass.:
367.4879
SMILES:
NC(=O)CN1CC(CC#N)(C1)N1CCC(CC1)N[C@@H]1CC1c1ccccc1
: