Target
Lysine-specific histone demethylase 1A
Ligand
BDBM397591
Substrate
Meas. Tech.
LSD1 histone demethylase biochemical assay
IC50
<100±n/a nM
Citation
 Wu, LYao, W Cyclopropylamines as LSD1 inhibitors US Patent  US10676457 Publication Date 6/9/2020 
Target
Name:
Lysine-specific histone demethylase 1A
Synonyms:
AOF2 Flavin-containing amine oxidase domain-containing protein 2 KDM1A KIAA0601 Lysine-specific demethylase 1 (LSD1) Lysine-specific histone demethylase 1 (LSD1)
Type:
Enzyme
Mol. Mass.:
92901.01
Organism:
Homo sapiens (Human)
Description:
O60341
Residue:
852
  
Inhibitor
Name:
BDBM397591
Synonyms:
N,N-dimethyl-2-(1-(methylsulfonyl)-3-(4-(((1R,2S)-2-phenylcyclopropyl)amino)piperidin-1-yl)azetidin-3-yl)acetamide US11155532, Example 90 | US9994546, Example 90
Type:
Small organic molecule
Emp. Form.:
C22H34N4O3S
Mol. Mass.:
434.595
SMILES:
CN(C)C(=O)CC1(CN(C1)S(C)(=O)=O)N1CCC(CC1)N[C@@H]1CC1c1ccccc1
: