Target
Glycogen synthase kinase-3 beta
Ligand
BDBM357015
Substrate
Meas. Tech.
Caliper Kinase Assay
IC50
5150±n/a nM
Citation
 Johnson, JALloyd, JFinlay, HNeels, JDhondi, NKGunaga, PBanerjee, AAdisechan, A Quinazolines as potassium ion channel inhibitors US Patent  US10676460 Publication Date 6/9/2020 
Target
Name:
Glycogen synthase kinase-3 beta
Synonyms:
GSK-3 beta GSK3B Glycogen synthase kinase 3 beta (GSK3B) Glycogen synthase kinase-3 beta (GSK-3B) Glycogen synthase kinase-3 beta (GSK3B) Glycogen synthase kinase-3beta (GSK3B) | Serine/threonine-protein kinase GSK3B
Type:
Enzyme
Mol. Mass.:
46756.38
Organism:
Homo sapiens (Human)
Description:
P49841
Residue:
420
  
Inhibitor
Name:
BDBM357015
Synonyms:
US10214511, Example 19 | US10676460, Example 19
Type:
Small organic molecule
Emp. Form.:
C20H15ClN4
Mol. Mass.:
346.813
SMILES:
Clc1nc(NCc2ccccn2)c2c(cccc2n1)-c1ccccc1
: