Target
Casein kinase II subunit alpha'
Ligand
BDBM50239227
Substrate
Meas. Tech.
Caliper Kinase Assay
IC50
50000±n/a nM
Citation
 Johnson, JALloyd, JFinlay, HNeels, JDhondi, NKGunaga, PBanerjee, AAdisechan, A Quinazolines as potassium ion channel inhibitors US Patent  US10676460 Publication Date 6/9/2020 
Target
Name:
Casein kinase II subunit alpha'
Synonyms:
CK2A2 CSNK2A2 Casein kinase II alpha' Casein kinase II subunit alpha (CSNK2A2)
Type:
Protein
Mol. Mass.:
41223.82
Organism:
Homo sapiens (Human)
Description:
Residue:
350
  
Inhibitor
Name:
BDBM50239227
Synonyms:
CHEMBL4094440 US10676460, Example 7
Type:
Small organic molecule
Emp. Form.:
C25H20N6O2S
Mol. Mass.:
468.53
SMILES:
NS(=O)(=O)c1cncc(c1)-c1nc(NCc2ccccn2)c2c(cccc2n1)-c1ccccc1
: