Target
Tyrosine-protein kinase Lck
Ligand
BDBM50239227
Substrate
Meas. Tech.
Caliper Kinase Assay
IC50
50000±n/a nM
Citation
 Johnson, JALloyd, JFinlay, HNeels, JDhondi, NKGunaga, PBanerjee, AAdisechan, A Quinazolines as potassium ion channel inhibitors US Patent  US10676460 Publication Date 6/9/2020 
Target
Name:
Tyrosine-protein kinase Lck
Synonyms:
2.7.10.2 LCK_HUMAN Leukocyte C-terminal Src kinase Lymphocyte-specific protein tyrosine kinase Protein YT16 Proto-oncogene tyrosine-protein kinase LCK T cell-specific protein-tyrosine kinase
Type:
Mol. Mass.:
57987.83
Organism:
Homo sapiens (Human)
Description:
P06239
Residue:
509
  
Inhibitor
Name:
BDBM50239227
Synonyms:
CHEMBL4094440 US10676460, Example 7
Type:
Small organic molecule
Emp. Form.:
C25H20N6O2S
Mol. Mass.:
468.53
SMILES:
NS(=O)(=O)c1cncc(c1)-c1nc(NCc2ccccn2)c2c(cccc2n1)-c1ccccc1
: