Target
Non-receptor tyrosine-protein kinase TYK2
Ligand
BDBM50239229
Substrate
Meas. Tech.
Caliper Kinase Assay
IC50
50000±n/a nM
Citation
 Johnson, JALloyd, JFinlay, HNeels, JDhondi, NKGunaga, PBanerjee, AAdisechan, A Quinazolines as potassium ion channel inhibitors US Patent  US10676460 Publication Date 6/9/2020 
Target
Name:
Non-receptor tyrosine-protein kinase TYK2
Synonyms:
Non-receptor tyrosine-protein kinase TYK2 (TYK2) TYK2_HUMAN | Tyrosine-protein kinase TYK2
Type:
Protein
Mol. Mass.:
133666.03
Organism:
Homo sapiens (Human)
Description:
P29597
Residue:
1187
  
Inhibitor
Name:
BDBM50239229
Synonyms:
CHEMBL4097255 | US10676460, Example 1
Type:
Small organic molecule
Emp. Form.:
C24H18N6
Mol. Mass.:
390.4399
SMILES:
C(Nc1nc(nc2cccc(-c3ccccc3)c12)-c1cncnc1)c1ccccn1
: