Target
5-hydroxytryptamine receptor 2A
Ligand
BDBM352205
Substrate
Meas. Tech.
Radiolabel Binding Studies for Serotonin 5HT7 Receptors
IC50
46.0±n/a nM
Citation
 Canney, DJBlass, BEGao, RAbou-Gharbia, M 5-hydroxytryptamine receptor 7 activity modulators and their method of use US Patent  US10676464 Publication Date 6/9/2020
Target
Name:
5-hydroxytryptamine receptor 2A
Synonyms:
5-HT-2 5-HT2A 5-hydroxytryptamine receptor 2A (5HT-2A) 5HT2A_HUMAN HTR2A | Serotonin receptor 2A
Type:
undefined
Mol. Mass.:
52607.65
Organism:
Homo sapiens (Human)
Description:
P28223
Residue:
471
  
Inhibitor
Name:
BDBM352205
Synonyms:
US10239868, Entry 9 US10676464, Entry 9 | US9802924, Entry 9
Type:
Small organic molecule
Emp. Form.:
C19H29N3O2
Mol. Mass.:
331.4525
SMILES:
CCC1(CC)CC(CCN2CCN(CC2)c2ccccn2)OC1=O
: