Target
5-hydroxytryptamine receptor 2A
Ligand
BDBM352221
Substrate
Meas. Tech.
Radiolabel Binding Studies for Serotonin 5HT7 Receptors
IC50
49.0±n/a nM
Citation
 Canney, DJBlass, BEGao, RAbou-Gharbia, M 5-hydroxytryptamine receptor 7 activity modulators and their method of use US Patent  US10676464 Publication Date 6/9/2020
Target
Name:
5-hydroxytryptamine receptor 2A
Synonyms:
5-HT-2 5-HT2A 5-hydroxytryptamine receptor 2A (5HT-2A) 5HT2A_HUMAN HTR2A | Serotonin receptor 2A
Type:
undefined
Mol. Mass.:
52607.65
Organism:
Homo sapiens (Human)
Description:
P28223
Residue:
471
  
Inhibitor
Name:
BDBM352221
Synonyms:
US10239868, Entry 25 US10676464, Entry 25 | US9802924, Entry 25
Type:
Small organic molecule
Emp. Form.:
C21H30N2O3
Mol. Mass.:
358.4745
SMILES:
Oc1ccccc1N1CCN(CCC2CC3(CCCCC3)C(=O)O2)CC1
: