Target
Glucagon-like peptide 1 receptor
Ligand
BDBM450657
Substrate
Meas. Tech.
CHO GLP-1R Clone H6 Assay 1
EC50
7.80±n/a nM
Citation
 Aspnes, GEBagley, SWCurto, JMEdmonds, DJFlanagan, MEFutatsugi, KGriffith, DAHuard, KLian, YLimberakis, CLondregan, ATMathiowetz, AMPiotrowski, DWRuggeri, RB GLP-1 receptor agonists and uses thereof US Patent  US10676465 Publication Date 6/9/2020 
Target
Name:
Glucagon-like peptide 1 receptor
Synonyms:
GLP-1 receptor GLP-1R GLP1R_HUMAN Glucagon-like peptide 1 receptor (GLP-1)
Type:
Enzyme
Mol. Mass.:
53035.78
Organism:
Homo sapiens (Human)
Description:
P43220
Residue:
463
  
Inhibitor
Name:
BDBM450657
Synonyms:
2-({4-[2-(4-cyanophenyl)-2-methyl-1,3- benzodioxol-4-yl]piperidin-1-yl}methyl)-1- (2-methoxyethyl)-1H-benzimidazole-6- carboxylic acid | US10676465, Example 34
Type:
Small organic molecule
Emp. Form.:
C32H32N4O5
Mol. Mass.:
552.6203
SMILES:
COCCn1c(CN2CCC(CC2)c2cccc3OC(C)(Oc23)c2ccc(cc2)C#N)nc2ccc(cc12)C(O)=O
: