Target
Glucagon-like peptide 1 receptor
Ligand
BDBM450698
Substrate
Meas. Tech.
CHO GLP-1R Clone H6 Assay 1
EC50
65.0±n/a nM
Citation
 Aspnes, GEBagley, SWCurto, JMEdmonds, DJFlanagan, MEFutatsugi, KGriffith, DAHuard, KLian, YLimberakis, CLondregan, ATMathiowetz, AMPiotrowski, DWRuggeri, RB GLP-1 receptor agonists and uses thereof US Patent  US10676465 Publication Date 6/9/2020 
Target
Name:
Glucagon-like peptide 1 receptor
Synonyms:
GLP-1 receptor GLP-1R GLP1R_HUMAN Glucagon-like peptide 1 receptor (GLP-1)
Type:
Enzyme
Mol. Mass.:
53035.78
Organism:
Homo sapiens (Human)
Description:
P43220
Residue:
463
  
Inhibitor
Name:
BDBM450698
Synonyms:
2-({4-[2-(4-chloro-2-fluorophenyl)-2- methyl-1,3-benzodioxol-4-yl]piperidin-1- yl}methyl)-1-(2-hydroxyethyl)-1H- benzimidazole-6-carboxylic acid | US10676465, Example 75
Type:
Small organic molecule
Emp. Form.:
C30H29ClFN3O5
Mol. Mass.:
566.02
SMILES:
CC1(Oc2cccc(C3CCN(Cc4nc5ccc(cc5n4CCO)C(O)=O)CC3)c2O1)c1ccc(Cl)cc1F
: