Target
Sphingosine 1-phosphate receptor 1
Ligand
BDBM450750
Substrate
Meas. Tech.
In Vitro Binding Assay
IC50
95.7±25.10 nM
Citation
 Tu, ZRosenberg, ALiu, HHan, J Compositions for binding sphingosine-1-phosphate receptor 1 (S1P1), imaging of S1P1, and methods of use thereof US Patent  US10676467 Publication Date 6/9/2020 
Target
Name:
Sphingosine 1-phosphate receptor 1
Synonyms:
CHEDG1 Endothelial differentiation G-protein coupled receptor 1 S1P1 S1PR1_HUMAN Sphingosine 1-phosphate receptor Edg-1
Type:
Enzyme
Mol. Mass.:
42836.02
Organism:
Homo sapiens (Human)
Description:
P21453
Residue:
382
  
Inhibitor
Name:
BDBM450750
Synonyms:
US10676467, Compound TZ 31 120
Type:
Small organic molecule
Emp. Form.:
C27H23F3N2O4
Mol. Mass.:
496.4777
SMILES:
COc1cccc(c1)-c1ccc(cc1C(F)(F)F)-c1nc2cc(ccc2o1)N1CCC(CC1)C(O)=O
: