Target
Sphingosine 1-phosphate receptor 3
Ligand
BDBM450753
Substrate
Meas. Tech.
In Vitro Binding Assay
IC50
>1000±n/a nM
Citation
 Tu, ZRosenberg, ALiu, HHan, J Compositions for binding sphingosine-1-phosphate receptor 1 (S1P1), imaging of S1P1, and methods of use thereof US Patent  US10676467 Publication Date 6/9/2020 
Target
Name:
Sphingosine 1-phosphate receptor 3
Synonyms:
C9orf108 EDG3 S1P receptor 3 S1P3 S1PR3_HUMAN Sphingosine 1-phosphate receptor 3 (S1P3) | Sphingosine 1-phosphate receptor Edg-3
Type:
G Protein-Coupled Receptor (GPCR)
Mol. Mass.:
42278.13
Organism:
Homo sapiens (Human)
Description:
Q99500
Residue:
378
  
Inhibitor
Name:
BDBM450753
Synonyms:
US10676467, Compound TZ 35 115
Type:
Small organic molecule
Emp. Form.:
C21H20FN3O4
Mol. Mass.:
397.3996
SMILES:
OC(=O)C1CN(Cc2ccc(cc2)-c2noc(n2)-c2ccc(OCCF)cc2)C1
: