Target
Sphingosine 1-phosphate receptor 2
Ligand
BDBM450765
Substrate
Meas. Tech.
In Vitro Binding Assay
IC50
>1000±n/a nM
Citation
 Tu, ZRosenberg, ALiu, HHan, J Compositions for binding sphingosine-1-phosphate receptor 1 (S1P1), imaging of S1P1, and methods of use thereof US Patent  US10676467 Publication Date 6/9/2020 
Target
Name:
Sphingosine 1-phosphate receptor 2
Synonyms:
EDG5 S1PR2 Sphingosine 1-phosphate receptor Sphingosine-1-phosphate receptor 2 | ndothelial differentiation G-protein coupled receptor 5
Type:
G Protein-Coupled Receptor (GPCR)
Mol. Mass.:
38883.16
Organism:
Homo sapiens (Human)
Description:
Membranes isolated from S1P2-transfected CHO cells were used in ligand binding assay.
Residue:
353
  
Inhibitor
Name:
BDBM450765
Synonyms:
US10676467, Compound TZ 43 73
Type:
Small organic molecule
Emp. Form.:
C17H13F4N3O4S
Mol. Mass.:
431.361
SMILES:
NS(=O)(=O)c1ccc(cc1)-c1noc(n1)-c1ccc(OCCF)c(c1)C(F)(F)F
: