Target
Sphingosine 1-phosphate receptor 1
Ligand
BDBM450775
Substrate
Meas. Tech.
In Vitro Binding Assay
IC50
30.8±7.8 nM
Citation
 Tu, ZRosenberg, ALiu, HHan, J Compositions for binding sphingosine-1-phosphate receptor 1 (S1P1), imaging of S1P1, and methods of use thereof US Patent  US10676467 Publication Date 6/9/2020 
Target
Name:
Sphingosine 1-phosphate receptor 1
Synonyms:
CHEDG1 Endothelial differentiation G-protein coupled receptor 1 S1P1 S1PR1_HUMAN Sphingosine 1-phosphate receptor Edg-1
Type:
Enzyme
Mol. Mass.:
42836.02
Organism:
Homo sapiens (Human)
Description:
P21453
Residue:
382
  
Inhibitor
Name:
BDBM450775
Synonyms:
US10676467, Compound TZ 43 151
Type:
Small organic molecule
Emp. Form.:
C18H31FNO5P
Mol. Mass.:
391.4146
SMILES:
NC(CO)(CCc1ccc(CCCCCCCF)cc1)COP(O)(O)=O
: