Target
Sphingosine 1-phosphate receptor 1
Ligand
BDBM450785
Substrate
Meas. Tech.
In Vitro Binding Assay
IC50
7.40±1.8 nM
Citation
 Tu, ZRosenberg, ALiu, HHan, J Compositions for binding sphingosine-1-phosphate receptor 1 (S1P1), imaging of S1P1, and methods of use thereof US Patent  US10676467 Publication Date 6/9/2020 
Target
Name:
Sphingosine 1-phosphate receptor 1
Synonyms:
CHEDG1 Endothelial differentiation G-protein coupled receptor 1 S1P1 S1PR1_HUMAN Sphingosine 1-phosphate receptor Edg-1
Type:
Enzyme
Mol. Mass.:
42836.02
Organism:
Homo sapiens (Human)
Description:
P21453
Residue:
382
  
Inhibitor
Name:
BDBM450785
Synonyms:
US10676467, Compound TZ 43 91
Type:
Small organic molecule
Emp. Form.:
C18H13F4N5O2
Mol. Mass.:
407.3217
SMILES:
FCCOc1ccc(cc1C(F)(F)F)-c1nc(no1)-c1ccc(CN=[N+]=[N-])cc1
: