Target
Protein S100-A9
Ligand
BDBM299093
Substrate
Meas. Tech.
S100A9-RAGE inhibition assay
IC50
180±n/a nM
Citation
 Fritzson, ILiberg, DEast, SMackinnon, CPrevost, N N-(heteroaryl)-sulfonamide derivatives useful as S100-inhibitors US Patent  US10125125 Publication Date 11/13/2018 
Target
Name:
Protein S100-A9
Synonyms:
CAGB Calgranulin-B Leukocyte L1 complex heavy chain MRP14 S100 calcium-binding protein A9 S10A9_HUMAN | p14
Type:
Enzyme Catalytic Domain
Mol. Mass.:
13239.84
Organism:
Homo sapiens (Human)
Description:
Residue:
114
  
Inhibitor
Name:
BDBM299093
Synonyms:
N-(2-chloro-5-hydroxypyrimidin-4-yl)-1-(3,5-dichlorophenyl)methanesulfonamide | US10125125, Example 143
Type:
Small organic molecule
Emp. Form.:
C11H8Cl3N3O3S
Mol. Mass.:
368.624
SMILES:
Oc1cnc(Cl)nc1NS(=O)(=O)Cc1cc(Cl)cc(Cl)c1
: