Target
Kappa-type opioid receptor
Ligand
BDBM50531916
Substrate
Meas. Tech.
KOR Antagonist Assay
IC50
<1±n/a nM
Citation
 Roberts, EGuerrero, MAUrbano, MRosen, HJones, RMLaxamana, CMZhao, XTurtle, ED Kappa opioid receptor antagonists and products and methods related thereto US Patent  US10676469 Publication Date 6/9/2020 
Target
Name:
Kappa-type opioid receptor
Synonyms:
K-OR-1 Kappa-opioid receptor (KOR) Kappa-type opioid receptor (KOR) OPIATE Kappa OPRK1 kappa opioid receptor (KOR)
Type:
G Protein-Coupled Receptor (GPCR)
Mol. Mass.:
42648.76
Organism:
Homo sapiens (Human)
Description:
P41145
Residue:
380
  
Inhibitor
Name:
BDBM50531916
Synonyms:
CHEMBL4456582 US11124504, Cpd. No. 145
Type:
Small organic molecule
Emp. Form.:
C24H30FN5O2
Mol. Mass.:
439.5257
SMILES:
CCc1cc(F)c2nc(N3CCC(CC3)N[C@@H]3CCOC3)c(-c3nc(C)no3)c(C)c2c1
: