Target
Kappa-type opioid receptor
Ligand
BDBM450880
Substrate
Meas. Tech.
KOR Antagonist Assay
IC50
5.5±n/a nM
Citation
 Roberts, EGuerrero, MAUrbano, MRosen, HJones, RMLaxamana, CMZhao, XTurtle, ED Kappa opioid receptor antagonists and products and methods related thereto US Patent  US10676469 Publication Date 6/9/2020 
Target
Name:
Kappa-type opioid receptor
Synonyms:
K-OR-1 Kappa-opioid receptor (KOR) Kappa-type opioid receptor (KOR) OPIATE Kappa OPRK1 kappa opioid receptor (KOR)
Type:
G Protein-Coupled Receptor (GPCR)
Mol. Mass.:
42648.76
Organism:
Homo sapiens (Human)
Description:
P41145
Residue:
380
  
Inhibitor
Name:
BDBM450880
Synonyms:
US10676469, Compound 151 | US11124504, Cpd. No. 151
Type:
Small organic molecule
Emp. Form.:
C25H32FN5O2
Mol. Mass.:
453.5523
SMILES:
CCc1cc(F)c2nc(N3CCC(CC3)N[C@H]3CCCOC3)c(-c3noc(C)n3)c(C)c2c1
: