Target
Lys-gingipain W83
Ligand
BDBM397434
Substrate
Meas. Tech.
Inhibition of Lysine Gingipain
IC50
17.5±n/a nM
Citation
 Konradi, AWDominy, SSLynch, CCCoburn, CVacca, J Inhibitors of lysine gingipain US Patent  US10676470 Publication Date 6/9/2020 
Target
Name:
Lys-gingipain W83
Synonyms:
KGP83_PORGN Lysine specific cysteine protease Porphypain kgp prtP
Type:
Mol. Mass.:
187834.89
Organism:
Porphyromonas gingivalis
Description:
Q51817
Residue:
1732
  
Inhibitor
Name:
BDBM397434
Synonyms:
US10676470, Compound 3 | US9988375, Compound 3
Type:
Small organic molecule
Emp. Form.:
C28H34N4O3S
Mol. Mass.:
506.66
SMILES:
NCCCC[C@H](NC(=O)[C@H]1CCCN(C1)C(=O)CCc1ccccc1)C(=O)c1nc2ccccc2s1
: