Target
Lys-gingipain W83
Ligand
BDBM397452
Substrate
Meas. Tech.
Inhibition of Lysine Gingipain
IC50
17.5±n/a nM
Citation
 Konradi, AWDominy, SSLynch, CCCoburn, CVacca, J Inhibitors of lysine gingipain US Patent  US10676470 Publication Date 6/9/2020 
Target
Name:
Lys-gingipain W83
Synonyms:
KGP83_PORGN Lysine specific cysteine protease Porphypain kgp prtP
Type:
Mol. Mass.:
187834.89
Organism:
Porphyromonas gingivalis
Description:
Q51817
Residue:
1732
  
Inhibitor
Name:
BDBM397452
Synonyms:
US10676470, Compound 29 US9988375, Compound 29
Type:
Small organic molecule
Emp. Form.:
C20H26N4O4S
Mol. Mass.:
418.51
SMILES:
CC(=O)N1CCOC(C1)C(=O)N[C@@H](CCCCN)C(=O)c1nc2ccccc2s1
: