Target
Heat shock protein HSP 90-alpha
Ligand
BDBM50165272
Substrate
Meas. Tech.
biochemical assay
EC50
50.8±4 nM
Citation
 Chiosis, GHe, HLlauger-Bufi, LKim, JLarson, SMSmith-Jones, P Small-molecule HSP90 inhibitors US Patent  US10676476 Publication Date 6/9/2020 
Target
Name:
Heat shock protein HSP 90-alpha
Synonyms:
HS90A_HUMAN HSP86 HSP90AA1 HSPCA Heat shock 86 kDa Heat shock protein HSP 90-alpha (HSP90) LAP-2 Lipopolysaccharide-associated protein 2 heat shock protein 90kDa alpha (cytosolic), class A member 1 isoform 2
Type:
Molecular Chaperone
Mol. Mass.:
84623.45
Organism:
Homo sapiens (Human)
Description:
P07900
Residue:
732
  
Inhibitor
Name:
BDBM50165272
Synonyms:
8-(6-Bromo-benzo[1,3]dioxol-5-ylsulfanyl)-9-pent-4-ynyl-9H-purin-6-ylamine CHEMBL365159 | US10676476, Example 1
Type:
Small organic molecule
Emp. Form.:
C17H14BrN5O2S
Mol. Mass.:
432.294
SMILES:
Nc1ncnc2n(CCCC#C)c(Sc3cc4OCOc4cc3Br)nc12
: