Target
Receptor tyrosine-protein kinase erbB-2
Ligand
BDBM50180301
Substrate
Meas. Tech.
biochemical assay
IC50
80.0±10 nM
Citation
 Chiosis, GHe, HLlauger-Bufi, LKim, JLarson, SMSmith-Jones, P Small-molecule HSP90 inhibitors US Patent  US10676476 Publication Date 6/9/2020 
Target
Name:
Receptor tyrosine-protein kinase erbB-2
Synonyms:
2.7.10.1 CD_antigen=CD340 ERBB2_HUMAN FASN/HER2 HER2 MLN19 NEU Proto-oncogene Neu Tyrosine kinase-type cell surface receptor HER2 | p185erbB2
Type:
Mol. Mass.:
137894.47
Organism:
Homo sapiens (Human)
Description:
P04626
Residue:
1255
  
Inhibitor
Name:
BDBM50180301
Synonyms:
2-FLUORO-8-[(6-IODO-1,3-BENZODIOXOL-5-YL)METHYL]-9-[3-(ISOPROPYLAMINO)PROPYL]-9H-PURIN-6-AMINE 2-fluoro-8-(6-iodo-benzo[1,3]dioxol-5-ylmethyl)-9-(3-isopropylamino-propyl)adenine US10336757, Compound PU-DZ8 | US10676476, Example 8
Type:
Small organic molecule
Emp. Form.:
C19H22FIN6O2
Mol. Mass.:
512.3199
SMILES:
CC(C)NCCCn1c(Cc2cc3OCOc3cc2I)nc2c(N)nc(F)nc12
: